Page 2 of 4 First 123 ... Last
  1. #11
    Join Date
    Mar 2007
    Posts
    40
    Isn't this the same toolchain that it was available ages ago?

  2. #12
    Join Date
    Oct 2008
    Posts
    11
    i tried to install it under ubuntu 10.04 and got
    /tmp/cc6nczI6.s: Assembler messages:
    /tmp/cc6nczI6.s:68: Error: syntax error; found `@' but expected `,'
    /tmp/cc6nczI6.s:68: Error: junk at end of line: [email protected]'
    /tmp/cc6nczI6.s:85: Error: syntax error; found `@' but expected `,'
    /tmp/cc6nczI6.s:85: Error: junk at end of line: [email protected]'
    /tmp/cc6nczI6.s:98: Error: syntax error; found `@' but expected `,'
    /tmp/cc6nczI6.s:98: Error: junk at end of line: [email protected]'
    /tmp/ccDQJEOa.s: Assembler messages:
    /tmp/ccDQJEOa.s:75: Error: syntax error; found `@' but expected `,'
    /tmp/ccDQJEOa.s:75: Error: junk at end of line: [email protected]'
    /tmp/ccDQJEOa.s:120: Error: syntax error; found `@' but expected `,'
    /tmp/ccDQJEOa.s:120: Error: junk at end of line: [email protected]'
    /tmp/ccDQJEOa.s:133: Error: syntax error; found `@' but expected `,'
    /tmp/ccDQJEOa.s:133: Error: junk at end of line: [email protected]'
    /tmp/cchdSibb.s: Assembler messages:
    /tmp/cchdSibb.s:98: Error: syntax error; found `@' but expected `,'
    /tmp/cchdSibb.s:98: Error: junk at end of line: [email protected]'
    /tmp/cchdSibb.s:113: Error: syntax error; found `@' but expected `,'
    /tmp/cchdSibb.s:113: Error: junk at end of line: [email protected]'
    make[8]: *** [lib_a-argz_add.o] Error 1
    make[8]: *** Waiting for unfinished jobs....
    make[8]: *** [lib_a-argz_add_sep.o] Error 1
    make[8]: *** [lib_a-argz_append.o] Error 1
    /tmp/cc7IwuWz.s: Assembler messages:
    /tmp/cc7IwuWz.s:19: Error: Relocation cannot be done when using -mrelocatable
    /tmp/cc7IwuWz.s:19: Error: Relocation cannot be done when using -mrelocatable
    make[8]: *** [lib_a-argz_count.o] Error 1
    make[8]: Leaving directory `/home/nico/ps3dev/scripts/build/newlib-1.18.0/build-ppu/ppu/nof/newlib/libc/argz'
    make[7]: *** [all-recursive] Error 1
    make[7]: Leaving directory `/home/nico/ps3dev/scripts/build/newlib-1.18.0/build-ppu/ppu/nof/newlib/libc'
    make[6]: *** [all-recursive] Error 1
    make[6]: Leaving directory `/home/nico/ps3dev/scripts/build/newlib-1.18.0/build-ppu/ppu/nof/newlib'
    make[5]: *** [all] Error 2
    make[5]: Leaving directory `/home/nico/ps3dev/scripts/build/newlib-1.18.0/build-ppu/ppu/nof/newlib'
    make[4]: *** [multi-do] Error 1
    make[4]: Leaving directory `/home/nico/ps3dev/scripts/build/newlib-1.18.0/build-ppu/ppu/newlib'
    make[3]: *** [all-multi] Error 2
    make[3]: Leaving directory `/home/nico/ps3dev/scripts/build/newlib-1.18.0/build-ppu/ppu/newlib'
    make[2]: *** [all] Error 2
    make[2]: Leaving directory `/home/nico/ps3dev/scripts/build/newlib-1.18.0/build-ppu/ppu/newlib'
    make[1]: *** [all-target-newlib] Error 2
    make[1]: Leaving directory `/home/nico/ps3dev/scripts/build/newlib-1.18.0/build-ppu'
    make: *** [all] Error 2
    ../scripts/003-newlib-1.18.0-PPU.sh: Failed.
    has anyone an idea, what went wrong ?

  3. #13
    Join Date
    May 2007
    Posts
    368
    Quote Originally Posted by Zhar View Post
    Getting

    ERROR: Add /usr/local/ps3dev/bin to your path before continuing.
    when I run ./toolchain.sh

    anyone know how to fix it?
    It does say in the Original post:
    2) Add the following to your login script:

    export PS3DEV=/usr/local/ps3dev
    export PATH=$PATH:$PS3DEV/bin
    export PATH=$PATH:$PS3DEV/ppu/bin
    export PATH=$PATH:$PS3DEV/spu/bin
    Quote Originally Posted by darkdroid View Post
    Is there anyway to load .elf files on PS3 with the jailbreak yet? I'd like to be able to load my PS2 games from external hdd.
    I'm assuming you mean for a non-bc ps3, because if you check then you can see the ability to load ps2 games off an external has been around for awhile now:

    http://www.ps4news.com/forums/ps3-gu...ap-104735.html

    http://www.ps4news.com/forums/ps3-gu...ly-104736.html

    http://www.ps4news.com/forums/ps3-gu...er-104052.html

    I wouldn't know 100% but i'm pretty sure that the psjb or it's clones do not allow for non-bc ps3's to play ps2 games in any format.

  4. #14
    Join Date
    Oct 2008
    Posts
    11
    Quote Originally Posted by Zhar View Post
    Getting

    ERROR: Add /usr/local/ps3dev/bin to your path before continuing.
    when I run ./toolchain.sh

    anyone know how to fix it?
    just do step 2, and whether reboot or execute the commands to extend your path-variable.

    maybe the path has to exist and has to be writable. i dont know the error, if it is not so.

  5. #15
    Join Date
    Jun 2007
    Posts
    31
    Quote Originally Posted by alleschonweg View Post
    just do step 2, and whether reboot or execute the commands to extend your path-variable.

    maybe the path has to exist and has to be writable. i dont know the error, if it is not so.
    have done step2
    rebooted
    still getting error

    Probably something stupidly simple that I have overlooked.

  6. #16
    Join Date
    Apr 2010
    Posts
    3
    Quote Originally Posted by mukumuku View Post
    Isn't this the same toolchain that it was available ages ago?
    That toolchain from your hyperlink can be used for generating linux executables for OtherOS (lv1).

    With this toolkit (compiler, linker) you can create ps3 (lv2) executables, by using the C sources and header files from the (official) ps3 sdk.

  7. #17
    Join Date
    Sep 2010
    Posts
    12
    Awesome contribution. This should turn the PS3 into a Popcorn Hour box with the right homebrew!

  8. #18
    Join Date
    Dec 2009
    Posts
    221
    Fantastic!

    I wonder if you can only build apps for the GameOS with this, or an actual Custom Firmware?

  9. #19
    Join Date
    Jul 2007
    Posts
    11

    [Register or Login to view code]


    [Register or Login to view code]


    [Register or Login to view code]


  10. #20
    Join Date
    Sep 2007
    Posts
    475
    I am also getting errors compiling:

    [Register or Login to view code]


Page 2 of 4 First 123 ... Last

Posting Permissions

  • You may not post new threads
  • You may not post replies
  • You may not post attachments
  • You may not edit your posts
  •  

Log in

Log in